Target
Cytochrome P450 2C19
Ligand
BDBM50234038
Substrate
Meas. Tech.
ChEMBL_1652002 (CHEMBL4001257)
IC50
>5000±n/a nM
Citation
 Markwalder, JASeitz, SPBlat, YElkin, LHunt, JTPabalan, JGJure-Kunkel, MNVite, GDCovello, K Identification and optimization of a novel series of indoleamine 2,3-dioxygenase inhibitors. Bioorg Med Chem Lett 27:582-585 (2017)  
Target
Name:
Cytochrome P450 2C19
Synonyms:
(R)-limonene 6-monooxygenase (S)-limonene 7-monooxygenase CYP2C19 CYPIIC19 Cytochrome P450 2C19 [I331V] Cytochrome P450-254C Mephenytoin 4-hydroxylase P450-254C
Type:
Enzyme
Mol. Mass.:
55935.47
Organism:
Homo sapiens (Human)
Description:
P33261
Residue:
490
  
Inhibitor
Name:
BDBM50234038
Synonyms:
CHEMBL4097275
Type:
Small organic molecule
Emp. Form.:
C31H27F3N2O5
Mol. Mass.:
564.5517
SMILES:
CC(C)(C)c1ccccc1Oc1ccc(cc1NC(=O)Nc1ccc(OC(F)(F)F)cc1)-c1cccc(c1)C(O)=O
: