Target
Indoleamine 2,3-dioxygenase 1
Ligand
BDBM50234069
Substrate
Meas. Tech.
ChEMBL_1652013 (CHEMBL4001268)
IC50
2400±n/a nM
Citation
 Markwalder, JASeitz, SPBlat, YElkin, LHunt, JTPabalan, JGJure-Kunkel, MNVite, GDCovello, K Identification and optimization of a novel series of indoleamine 2,3-dioxygenase inhibitors. Bioorg Med Chem Lett 27:582-585 (2017)  
Target
Name:
Indoleamine 2,3-dioxygenase 1
Synonyms:
I23O1_HUMAN IDO-1 INDO Indoleamine 2,3-dioxygenase | Indoleamine-pyrrole 2,3-dioxygenase
Type:
Enzyme
Mol. Mass.:
45330.80
Organism:
Homo sapiens (Human)
Description:
P14902
Residue:
403
  
Inhibitor
Name:
BDBM50234069
Synonyms:
CHEMBL4069208 | US9765018, Example 1
Type:
Small organic molecule
Emp. Form.:
C31H29ClN2O4
Mol. Mass.:
529.026
SMILES:
Cc1ccc(NC(=O)Nc2cc(ccc2Oc2ccccc2C(C)(C)C)-c2ccc(Cl)c(c2)C(O)=O)cc1
: