Target
Indoleamine 2,3-dioxygenase 1
Ligand
BDBM50234071
Substrate
Meas. Tech.
ChEMBL_1652013 (CHEMBL4001268)
IC50
840±n/a nM
Citation
 Markwalder, JASeitz, SPBlat, YElkin, LHunt, JTPabalan, JGJure-Kunkel, MNVite, GDCovello, K Identification and optimization of a novel series of indoleamine 2,3-dioxygenase inhibitors. Bioorg Med Chem Lett 27:582-585 (2017)  
Target
Name:
Indoleamine 2,3-dioxygenase 1
Synonyms:
I23O1_HUMAN IDO-1 INDO Indoleamine 2,3-dioxygenase | Indoleamine-pyrrole 2,3-dioxygenase
Type:
Enzyme
Mol. Mass.:
45330.80
Organism:
Homo sapiens (Human)
Description:
P14902
Residue:
403
  
Inhibitor
Name:
BDBM50234071
Synonyms:
CHEMBL4075095 | US9765018, Example 73
Type:
Small organic molecule
Emp. Form.:
C29H26N2O5
Mol. Mass.:
482.5271
SMILES:
COc1ccc(cc1C(O)=O)-c1ccc(Oc2ccccc2C)c(NC(=O)Nc2ccc(C)cc2)c1
: