Target
Polyphenol oxidase 2
Ligand
BDBM50234124
Substrate
Meas. Tech.
ChEMBL_1652196 (CHEMBL4001451)
IC50
10200±n/a nM
Citation
 Xie, WZhang, HHe, JZhang, JYu, QLuo, CLi, S Synthesis and biological evaluation of novel hydroxybenzaldehyde-based kojic acid analogues as inhibitors of mushroom tyrosinase. Bioorg Med Chem Lett 27:530-532 (2017)  
Target
Name:
Polyphenol oxidase 2
Synonyms:
Monophenol monooxygenase PPO2 Tyrosinase
Type:
Protein
Mol. Mass.:
63923.66
Organism:
Agaricus bisporus (Common mushroom)
Description:
O42713
Residue:
556
  
Inhibitor
Name:
BDBM50234124
Synonyms:
CHEMBL4088468
Type:
Small organic molecule
Emp. Form.:
C16H16N4O4S
Mol. Mass.:
360.388
SMILES:
Cc1nnc(SCc2cc(=O)c(O)co2)n1NCc1ccccc1O
: