Target
Tryptophan 5-hydroxylase 1
Ligand
BDBM50234216
Substrate
Meas. Tech.
ChEMBL_1652543 (CHEMBL4001798)
IC50
30±n/a nM
Citation
 Goldberg, DRDe Lombaert, SAiello, RBourassa, PBarucci, NZhang, QParalkar, VStein, AJHolt, MValentine, JZavadoski, W Optimization of spirocyclic proline tryptophan hydroxylase-1 inhibitors. Bioorg Med Chem Lett 27:413-419 (2017)  
Target
Name:
Tryptophan 5-hydroxylase 1
Synonyms:
TPH TPH1_HUMAN TRPH | Tryptophan 5-monooxygenase 1
Type:
PROTEIN
Mol. Mass.:
50990.64
Organism:
Homo sapiens (Human)
Description:
ChEMBL_1361824
Residue:
444
  
Inhibitor
Name:
BDBM50234216
Synonyms:
CHEMBL4090304
Type:
Small organic molecule
Emp. Form.:
C28H26ClF3N6O3
Mol. Mass.:
586.993
SMILES:
Nc1nc(O[C@H](c2ccc(Cl)cc2-c2cccc(c2)C#N)C(F)(F)F)cc(n1)N1CCC2(CN[C@@H](C2)C(O)=O)CC1
: