Target
Sodium-dependent serotonin transporter
Ligand
BDBM50234235
Substrate
Meas. Tech.
ChEMBL_1652599 (CHEMBL4001854)
EC50
29600±n/a nM
Citation
 Topiol, SBang-Andersen, BSanchez, CPlenge, PLoland, CJJuhl, KLarsen, KBregnedal, PBøgesø, KP X-ray structure based evaluation of analogs of citalopram: Compounds with increased affinity and selectivity compared with R-citalopram for the allosteric site (S2) on hSERT. Bioorg Med Chem Lett 27:470-478 (2017)  
Target
Name:
Sodium-dependent serotonin transporter
Synonyms:
5-HT Transporter 5HTT SC6A4_HUMAN SLC6A4 Serotonin transporter (5HTT) Sodium-dependent serotonin transporter (SERT) | Solute carrier family 6 member 4
Type:
Multi-pass membrane protein
Mol. Mass.:
70322.51
Organism:
Homo sapiens (Human)
Description:
P31645
Residue:
630
  
Inhibitor
Name:
BDBM50234235
Synonyms:
CHEMBL4062666
Type:
Small organic molecule
Emp. Form.:
C19H21Cl2NO
Mol. Mass.:
350.282
SMILES:
CN(C)CCCC1(OCc2ccccc12)c1ccc(Cl)c(Cl)c1
: