Target
Amino acid transporter
Ligand
BDBM50234291
Substrate
Meas. Tech.
ChEMBL_1652638 (CHEMBL4001893)
Ki
73000±n/a nM
Citation
 Singh, KTanui, RGameiro, AEisenberg, GColas, CSchlessinger, AGrewer, C Structure activity relationships of benzylproline-derived inhibitors of the glutamine transporter ASCT2. Bioorg Med Chem Lett 27:398-402 (2017)  
Target
Name:
Amino acid transporter
Synonyms:
Amino acid transporter | Slc1a5
Type:
PROTEIN
Mol. Mass.:
56758.53
Organism:
Rattus norvegicus
Description:
ChEMBL_109757
Residue:
539
  
Inhibitor
Name:
BDBM50234291
Synonyms:
CHEMBL4068819
Type:
Small organic molecule
Emp. Form.:
C12H14ClF2NO2
Mol. Mass.:
277.695
SMILES:
Cl.OC(=O)[C@@H]1C[C@@H](Cc2ccc(F)c(F)c2)CN1
: