Target
Xanthine dehydrogenase/oxidase
Ligand
BDBM50234442
Substrate
Meas. Tech.
ChEMBL_1652999 (CHEMBL4002254)
Ki
570±n/a nM
Citation
 Zhang, TJLi, SYYuan, WYWu, QXWang, LYang, SSun, QMeng, FH Discovery and biological evaluation of some (1H-1,2,3-triazol-4-yl)methoxybenzaldehyde derivatives containing an anthraquinone moiety as potent xanthine oxidase inhibitors. Bioorg Med Chem Lett 27:729-732 (2017)  
Target
Name:
Xanthine dehydrogenase/oxidase
Synonyms:
XDH Xanthine dehydrogenase Xanthine oxidase (XO)
Type:
Protein
Mol. Mass.:
146809.00
Organism:
Bos taurus (Bovine)
Description:
P80457
Residue:
1332
  
Inhibitor
Name:
BDBM50234442
Synonyms:
CHEMBL4069614
Type:
Small organic molecule
Emp. Form.:
C25H17N3O4
Mol. Mass.:
423.4202
SMILES:
O=Cc1ccccc1OCc1cn(Cc2ccc3C(=O)c4ccccc4C(=O)c3c2)nn1
: