Target
Carbonic anhydrase 1
Ligand
BDBM50234462
Substrate
Meas. Tech.
ChEMBL_1653004 (CHEMBL4002259)
Ki
865±n/a nM
Citation
 Abdel-Aziz, AAAngeli, AEl-Azab, ASAbu El-Enin, MASupuran, CT Synthesis and biological evaluation of cyclic imides incorporating benzenesulfonamide moieties as carbonic anhydrase I, II, IV and IX inhibitors. Bioorg Med Chem 25:1666-1671 (2017)  
Target
Name:
Carbonic anhydrase 1
Synonyms:
CA-I CAB Carbonate dehydratase I Carbonic anhydrase 1 (CA I) Carbonic anhydrase 1 (Recombinant CA I) Carbonic anhydrase B Carbonic anhydrase I (CA I) Carbonic anhydrase I (CAI) Carbonic anhydrase isoenzyme I (hCA I) | hCA
Type:
Enzyme
Mol. Mass.:
28873.37
Organism:
Homo sapiens (Human)
Description:
P00915
Residue:
261
  
Inhibitor
Name:
BDBM50234462
Synonyms:
CHEMBL3113927
Type:
Small organic molecule
Emp. Form.:
C16H13N3O6S
Mol. Mass.:
375.356
SMILES:
NS(=O)(=O)c1ccc(CCN2C(=O)c3ccc(cc3C2=O)[N+]([O-])=O)cc1
: