Target
Androgen receptor
Ligand
BDBM26258
Substrate
Meas. Tech.
ChEMBL_1653052 (CHEMBL4002307)
IC50
1.000000±n/a nM
Citation
 Silva-Ortiz, AVBratoeff, ERamírez-Apan, THeuze, YSoriano, JMoreno, IBravo, MBautista, LCabeza, M Synthesis of new derivatives of 21-imidazolyl-16-dehydropregnenolone as inhibitors of 5a-reductase 2 and with cytotoxic activity in cancer cells. Bioorg Med Chem 25:1600-1607 (2017)  
Target
Name:
Androgen receptor
Synonyms:
ANDR_RAT Ar Nr3c4 | androgen
Type:
Enzyme
Mol. Mass.:
98219.08
Organism:
Rattus norvegicus (Rat)
Description:
P15207
Residue:
902
  
Inhibitor
Name:
BDBM26258
Synonyms:
(1S,2R,9R,10R,11S,14S,15S)-14-hydroxy-9,14,15-trimethyltetracyclo[8.7.0.0^{2,7}.0^{11,15}]heptadec-6-en-5-one [3H]Mibolerone
Type:
radiolabeled ligand
Emp. Form.:
C20H30O2
Mol. Mass.:
302.451
SMILES:
[H][C@@]12CC[C@](C)(O)[C@@]1(C)CC[C@]1([H])[C@@]3([H])CCC(=O)C=C3C[C@@H](C)[C@@]21[H]
: