Target
Alpha-galactosidase A
Ligand
BDBM50241865
Substrate
Meas. Tech.
ChEMBL_1653300 (CHEMBL4002666)
IC50
750±n/a nM
Citation
 Cheng, WCWang, JHYun, WYLi, HYHu, JM Rapid preparation of (3R,4S,5R) polyhydroxylated pyrrolidine-based libraries to discover a pharmacological chaperone for treatment of Fabry disease. Eur J Med Chem 126:1-6 (2017)  
Target
Name:
Alpha-galactosidase A
Synonyms:
AGAL_HUMAN Alpha-D-galactoside galactohydrolase Alpha-glucosidase A (α-Gal A) INN=Agalsidase | Melibiase
Type:
Protein
Mol. Mass.:
48760.21
Organism:
Homo sapiens (Human)
Description:
Residue:
429
  
Inhibitor
Name:
BDBM50241865
Synonyms:
2,5-dideoxy-2,5-imino-D-altritol CHEMBL469844
Type:
Small organic molecule
Emp. Form.:
C6H13NO4
Mol. Mass.:
163.1717
SMILES:
OC[C@H]1N[C@H](CO)[C@H](O)[C@@H]1O
: