Target
Alpha-galactosidase A
Ligand
BDBM50234559
Substrate
Meas. Tech.
ChEMBL_1653299 (CHEMBL4002665)
IC50
10400±n/a nM
Citation
 Cheng, WCWang, JHYun, WYLi, HYHu, JM Rapid preparation of (3R,4S,5R) polyhydroxylated pyrrolidine-based libraries to discover a pharmacological chaperone for treatment of Fabry disease. Eur J Med Chem 126:1-6 (2017)  
Target
Name:
Alpha-galactosidase A
Synonyms:
AGAL_HUMAN Alpha-D-galactoside galactohydrolase Alpha-glucosidase A (α-Gal A) INN=Agalsidase | Melibiase
Type:
Protein
Mol. Mass.:
48760.21
Organism:
Homo sapiens (Human)
Description:
Residue:
429
  
Inhibitor
Name:
BDBM50234559
Synonyms:
CHEMBL4081664
Type:
Small organic molecule
Emp. Form.:
C17H32N2O4
Mol. Mass.:
328.447
SMILES:
OC[C@H]1N[C@H](CNC(=O)CCCCC2CCCCC2)[C@@H](O)[C@H]1O
: