Target
Vascular endothelial growth factor receptor 2
Ligand
BDBM50234568
Substrate
Meas. Tech.
ChEMBL_1653398 (CHEMBL4002764)
IC50
>100±n/a nM
Citation
 Liu, YPeng, XGuan, XLu, DXi, YJin, SChen, HZeng, LAi, JGeng, MHu, Y Discovery of novel Ponatinib analogues for reducing KDR activity as potent FGFRs inhibitors. Eur J Med Chem 126:122-132 (2017)  
Target
Name:
Vascular endothelial growth factor receptor 2
Synonyms:
CD_antigen=CD309 Fetal liver kinase 1 (FLK-1) KDR Protein-tyrosine kinase receptor Flk-1 VEGFR-2 VEGFR2 Vascular Endothelial Growth Factor Receptor Kinase 2 Vascular endothelial growth factor receptor 2 (KDR) Vascular endothelial growth factor receptor 2 (VEGFR2) Vascular endothelial growth factor receptor-2 (VEGFR-2)
Type:
Receptor Tyrosine Kinase
Mol. Mass.:
151510.97
Organism:
Homo sapiens (Human)
Description:
P35968
Residue:
1356
  
Inhibitor
Name:
BDBM50234568
Synonyms:
CHEMBL4088977
Type:
Small organic molecule
Emp. Form.:
C30H28F3N5O
Mol. Mass.:
531.5714
SMILES:
CN1CCN(Cc2ccc(NC(=O)c3ccc(C)c(c3)C#Cc3cncc4[nH]ccc34)cc2C(F)(F)F)CC1
: