Target
Fibroblast growth factor receptor 1
Ligand
BDBM50234570
Substrate
Meas. Tech.
ChEMBL_1653397 (CHEMBL4002763)
IC50
0.500000±n/a nM
Citation
 Liu, YPeng, XGuan, XLu, DXi, YJin, SChen, HZeng, LAi, JGeng, MHu, Y Discovery of novel Ponatinib analogues for reducing KDR activity as potent FGFRs inhibitors. Eur J Med Chem 126:122-132 (2017)  
Target
Name:
Fibroblast growth factor receptor 1
Synonyms:
BFGFR Basic fibroblast growth factor receptor 1 (FGFR1) CEK FGFR-1 FGFR-1, (FL) FGFR1_HUMAN FLT2 Fibroblast growth factor receptor 1 (FGFR-1) Fms-like tyrosine kinase 2 N-sam bFGF-R | c-fgr
Type:
Receptor
Mol. Mass.:
91861.70
Organism:
Homo sapiens (Human)
Description:
P11362
Residue:
822
  
Inhibitor
Name:
BDBM50234570
Synonyms:
CHEMBL4091628
Type:
Small organic molecule
Emp. Form.:
C31H31ClF3N5O2
Mol. Mass.:
598.058
SMILES:
CN1CCN(Cc2ccc(NC(=O)c3ccc(Cl)c(c3)C#Cc3cncc(c3)N3CCOCC3)cc2C(F)(F)F)CC1
: