Target
Serine/threonine-protein kinase PAK 1
Ligand
BDBM85511
Substrate
Meas. Tech.
ChEMBL_1653560 (CHEMBL4002926)
IC50
36000±n/a nM
Citation
 Nguyen, BCQTakahashi, HUto, YShahinozzaman, MDTawata, SMaruta, H 1,2,3-Triazolyl ester of Ketorolac: A"Click Chemistry"-based highly potent PAK1-blocking cancer-killer. Eur J Med Chem 126:270-276 (2017)  
Target
Name:
Serine/threonine-protein kinase PAK 1
Synonyms:
2.7.11.1 Cell division control protein 42 homolog PAK-1 PAK1_HUMAN p21-activated kinase 1 | p65-PAK
Type:
Mol. Mass.:
60640.15
Organism:
Homo sapiens (Human)
Description:
Q13153
Residue:
545
  
Inhibitor
Name:
BDBM85511
Synonyms:
CAS_74103-07-4 Ketorolac tris salt | Toradol
Type:
Small organic molecule
Emp. Form.:
C15H13NO3
Mol. Mass.:
255.2686
SMILES:
OC(=O)C1CCn2c1ccc2C(=O)c1ccccc1
: