Target
Cytochrome P450 2E1
Ligand
BDBM50234734
Substrate
Meas. Tech.
ChEMBL_1653836 (CHEMBL4003202)
IC50
>30000±n/a nM
Citation
 Giacobbo, BCPissinate, KRodrigues-Junior, VVillela, ADGrams, ESAbbadi, BLSubtil, FTSperotto, NTrindade, RVBack, DFCampos, MMBasso, LAMachado, PSantos, DS New insights into the SAR and drug combination synergy of 2-(quinolin-4-yloxy)acetamides against Mycobacterium tuberculosis. Eur J Med Chem 126:491-501 (2017)  
Target
Name:
Cytochrome P450 2E1
Synonyms:
CP2E1_HUMAN CYP2E1 | Cytochrome P450 2E1 (CYP2E1)
Type:
Enzyme
Mol. Mass.:
56860.34
Organism:
Homo sapiens (Human)
Description:
P05181
Residue:
493
  
Inhibitor
Name:
BDBM50234734
Synonyms:
CHEMBL4094462
Type:
Small organic molecule
Emp. Form.:
C24H28N2O3
Mol. Mass.:
392.4907
SMILES:
CCCCCc1ccc(NC(=O)COc2cc(C)nc3ccc(OC)cc23)cc1
: