Target
Dual specificity protein kinase CLK1
Ligand
BDBM50234810
Substrate
Meas. Tech.
ChEMBL_1653990 (CHEMBL4003356)
IC50
40±n/a nM
Citation
 Murár, MDobia?, J?ramel, PAddová, GHanquet, GBohác, A Novel CLK1 inhibitors based on N-aryloxazol-2-amine skeleton - A possible way to dual VEGFR2 TK/CLK ligands. Eur J Med Chem 126:754-761 (2017)  
Target
Name:
Dual specificity protein kinase CLK1
Synonyms:
CDC-like kinase 1 CDC2-like kinase 1 (CLK1) CLK1 Dual specificity protein kinase CLK1 Dual specificty protein kinase CLK1
Type:
Protein
Mol. Mass.:
57322.21
Organism:
Homo sapiens (Human)
Description:
P49759
Residue:
484
  
Inhibitor
Name:
BDBM50234810
Synonyms:
CHEMBL4065167
Type:
Small organic molecule
Emp. Form.:
C20H20N2O4S
Mol. Mass.:
384.449
SMILES:
CCS(=O)(=O)c1ccc(OC)c(Nc2ncc(\C=C\c3ccccc3)o2)c1
: