Target
Acetylcholinesterase
Ligand
BDBM50234821
Substrate
Meas. Tech.
ChEMBL_1654012 (CHEMBL4003378)
IC50
7320±n/a nM
Citation
 Li, YQiang, XLuo, LYang, XXiao, GLiu, QAi, JTan, ZDeng, Y Aurone Mannich base derivatives as promising multifunctional agents with acetylcholinesterase inhibition, anti-ß-amyloid aggragation and neuroprotective properties for the treatment of Alzheimer's disease. Eur J Med Chem 126:762-775 (2017)  
Target
Name:
Acetylcholinesterase
Synonyms:
ACES_RAT Acetylcholinesterase and butyrylcholinesterase (AChE and BChE) Acetylcholinesterase, AChE | Ache
Type:
Enzyme
Mol. Mass.:
68193.62
Organism:
Rattus norvegicus (rat)
Description:
P37136
Residue:
614
  
Inhibitor
Name:
BDBM50234821
Synonyms:
CHEMBL4072914
Type:
Small organic molecule
Emp. Form.:
C29H32N2O5
Mol. Mass.:
488.5748
SMILES:
CCN(Cc1ccc(\C=C2/Oc3cc(OC)c(OC)cc3C2=O)cc1O)Cc1ccccc1N(C)C
: