Target
Mitogen-activated protein kinase 10
Ligand
BDBM50234886
Substrate
Meas. Tech.
ChEMBL_1654061 (CHEMBL4003427)
IC50
2.0±n/a nM
Citation
 Muth, FEl-Gokha, AAnsideri, FEitel, MDöring, ESievers-Engler, ALange, ABoeckler, FMLämmerhofer, MKoch, PLaufer, SA Tri- and Tetrasubstituted Pyridinylimidazoles as Covalent Inhibitors of c-Jun N-Terminal Kinase 3. J Med Chem 60:594-607 (2017)  
Target
Name:
Mitogen-activated protein kinase 10
Synonyms:
JNK3 MAP kinase p49 3F12 MK10_HUMAN Mitogen-activated protein kinase 10 (Stress-activated protein kinase JNK3) (c-Jun N-terminal kinase 3) (MAP kinase p49 3F12) PRKM10 Stress-activated protein kinase JNK3 | c-Jun N-terminal kinase 3 (JNK3)
Type:
Enzyme
Mol. Mass.:
52586.89
Organism:
Homo sapiens (Human)
Description:
Residue:
464
  
Inhibitor
Name:
BDBM50234886
Synonyms:
CHEMBL4082278
Type:
Small organic molecule
Emp. Form.:
C26H24N6O2S
Mol. Mass.:
484.573
SMILES:
CSc1nc(C)c([nH]1)-c1ccnc(Nc2ccc(NC(=O)c3cccc(NC(=O)C=C)c3)cc2)c1
: