Target
Poly [ADP-ribose] polymerase 2
Ligand
BDBM50234915
Substrate
Meas. Tech.
ChEMBL_1654152 (CHEMBL4003518)
IC50
11600±n/a nM
Citation
 Nathubhai, AHaikarainen, TKoivunen, JMurthy, SKoumanov, FLloyd, MDHolman, GDPihlajaniemi, TTosh, DLehtiö, LThreadgill, MD Highly Potent and Isoform Selective Dual Site Binding Tankyrase/Wnt Signaling Inhibitors That Increase Cellular Glucose Uptake and Have Antiproliferative Activity. J Med Chem 60:814-820 (2017)  
Target
Name:
Poly [ADP-ribose] polymerase 2
Synonyms:
(ARTD2 or PARP2) ADPRTL2 PARP2_HUMAN Poly [ADP-ribose] polymerase 2 (PARP2)
Type:
Enzyme
Mol. Mass.:
66225.70
Organism:
Homo sapiens (Human)
Description:
Q9UGN5
Residue:
583
  
Inhibitor
Name:
BDBM50234915
Synonyms:
CHEMBL4069447
Type:
Small organic molecule
Emp. Form.:
C28H23N5O3
Mol. Mass.:
477.5139
SMILES:
Cc1cccc2c1nc(CCC(=O)Nc1ccc(cc1)C(=O)Nc1cccc3cccnc13)[nH]c2=O
: