Target
Histone acetyltransferase KAT2B
Ligand
BDBM50234934
Substrate
Meas. Tech.
ChEMBL_1654185 (CHEMBL4003551)
IC50
12589±n/a nM
Citation
 Humphreys, PGBamborough, PChung, CWCraggs, PDGordon, LGrandi, PHayhow, TGHussain, JJones, KLLindon, MMichon, AMRenaux, JFSuckling, CJTough, DFPrinjha, RK Discovery of a Potent, Cell Penetrant, and Selective p300/CBP-Associated Factor (PCAF)/General Control Nonderepressible 5 (GCN5) Bromodomain Chemical Probe. J Med Chem 60:695-709 (2017)  
Target
Name:
Histone acetyltransferase KAT2B
Synonyms:
Histone acetyltransferase KAT2A/KAT2B KAT2B PCAF
Type:
PROTEIN
Mol. Mass.:
93045.76
Organism:
Homo sapiens (Human)
Description:
ChEMBL_1502838
Residue:
832
  
Inhibitor
Name:
BDBM50234934
Synonyms:
CHEMBL4095646
Type:
Small organic molecule
Emp. Form.:
C12H12ClN3O
Mol. Mass.:
249.696
SMILES:
Cn1ncc(NCc2ccccc2)c(Cl)c1=O
: