Target
Ephrin type-A receptor 2
Ligand
BDBM50234952
Substrate
Meas. Tech.
ChEMBL_1654287 (CHEMBL4003653)
IC50
1820±n/a nM
Citation
 Incerti, MRusso, SCallegari, DPala, DGiorgio, CZanotti, IBarocelli, EVicini, PVacondio, FRivara, SCastelli, RTognolini, MLodola, A Metadynamics for Perspective Drug Design: Computationally Driven Synthesis of New Protein-Protein Interaction Inhibitors Targeting the EphA2 Receptor. J Med Chem 60:787-796 (2017)  
Target
Name:
Ephrin type-A receptor 2
Synonyms:
2.7.10.1 Eck Ephrin type-A receptor 2 Myk2 Tyrosine-protein kinase receptor ECK Tyrosine-protein kinase receptor SEK-2
Type:
PROTEIN
Mol. Mass.:
108847.01
Organism:
Mus musculus
Description:
ChEMBL_117464
Residue:
977
  
Inhibitor
Name:
BDBM50234952
Synonyms:
CHEMBL4079387
Type:
Small organic molecule
Emp. Form.:
C36H51NO4S
Mol. Mass.:
593.859
SMILES:
[H][C@@]1(CC[C@@]2([H])[C@]3([H])CC[C@]4([H])C[C@H](O)CC[C@]4(C)[C@@]3([H])CC[C@]12C)[C@H](C)CCC(=O)N[C@H](CC(O)=O)Cc1csc2ccccc12
: