Target
Proteasome subunit beta type-5
Ligand
BDBM50234984
Substrate
Meas. Tech.
ChEMBL_1654311 (CHEMBL4003677)
IC50
1.1±n/a nM
Citation
 Zhuang, RGao, LLv, XXi, JSheng, LZhao, YHe, RHu, XShao, YPan, XLiu, SHuang, WZhou, YLi, JZhang, J Exploration of novel piperazine or piperidine constructed non-covalent peptidyl derivatives as proteasome inhibitors. Eur J Med Chem 126:1056-1070 (2017)  
Target
Name:
Proteasome subunit beta type-5
Synonyms:
20S proteasome chymotrypsin-like LMPX PSB5_HUMAN Proteasome Macropain subunit MB1 X
Type:
Protein
Mol. Mass.:
28480.96
Organism:
Homo sapiens (Human)
Description:
Residue:
263
  
Inhibitor
Name:
BDBM50234984
Synonyms:
CHEMBL3218837
Type:
Small organic molecule
Emp. Form.:
C34H37ClN6O5
Mol. Mass.:
645.148
SMILES:
CC(C)(C)CNC(=O)C[C@H](NC(=O)C(=O)c1c[nH]c2ccccc12)C(=O)N[C@@H](Cc1ccncc1)C(=O)NCc1ccccc1Cl
: