Target
Sodium/glucose cotransporter 2
Ligand
BDBM176714
Substrate
Meas. Tech.
ChEMBL_1654380 (CHEMBL4003746)
IC50
2.7±n/a nM
Citation
 Goodwin, NCDing, ZMHarrison, BAStrobel, EDHarris, ALSmith, MThompson, AYXiong, WMseeh, FBruce, DJDiaz, DGopinathan, SLi, LO'Neill, EThiel, MWilson, AGCarson, KGPowell, DRRawlins, DB Discovery of LX2761, a Sodium-Dependent Glucose Cotransporter 1 (SGLT1) Inhibitor Restricted to the Intestinal Lumen, for the Treatment of Diabetes. J Med Chem 60:710-721 (2017)  
Target
Name:
Sodium/glucose cotransporter 2
Synonyms:
Na(+)/glucose cotransporter 2 SGLT2 Sodium-Dependent Glucose Cotransporter 2 (SGLT2) Solute carrier family 5 member 2
Type:
Protein
Mol. Mass.:
72902.00
Organism:
Homo sapiens (Human)
Description:
P31639
Residue:
672
  
Inhibitor
Name:
BDBM176714
Synonyms:
US9688710, 136 N-(1-((2-(dimethylamino)ethyl)amino)-2-methyl-1-oxopropan-2-yl)-4-(4-(2-methyl-5-((2S,3R,4R,5S,6R)-3,4,5-trihydroxy-6-(methylthio)tetrahydro-2H-pyran-2-yl)benzyl)phenyl)butanamide
Type:
Small organic molecule
Emp. Form.:
C32H47N3O6S
Mol. Mass.:
601.797
SMILES:
CS[C@H]1O[C@H]([C@H](O)[C@@H](O)[C@@H]1O)c1ccc(C)c(Cc2ccc(CCCC(=O)NC(C)(C)C(=O)NCCN(C)C)cc2)c1
: