Target
Dual specificity protein kinase CLK1
Ligand
BDBM50235028
Substrate
Meas. Tech.
ChEMBL_1654399 (CHEMBL4003765)
EC50
7800±n/a nM
Citation
 Shi, YPark, JLagisetti, CZhou, WSambucetti, LCWebb, TR A triple exon-skipping luciferase reporter assay identifies a new CLK inhibitor pharmacophore. Bioorg Med Chem Lett 27:406-412 (2017)  
Target
Name:
Dual specificity protein kinase CLK1
Synonyms:
CDC-like kinase 1 CDC2-like kinase 1 (CLK1) CLK1 Dual specificity protein kinase CLK1 Dual specificty protein kinase CLK1
Type:
Protein
Mol. Mass.:
57322.21
Organism:
Homo sapiens (Human)
Description:
P49759
Residue:
484
  
Inhibitor
Name:
BDBM50235028
Synonyms:
CHEMBL1532768
Type:
Small organic molecule
Emp. Form.:
C19H24ClN7
Mol. Mass.:
385.894
SMILES:
CCn1cnc2c(Nc3cccc(Cl)c3)nc(N[C@@H]3CCCC[C@H]3N)nc12
: