Target
Dual specificity protein kinase CLK2
Ligand
BDBM50235029
Substrate
Meas. Tech.
ChEMBL_1654403 (CHEMBL4003769)
IC50
92±n/a nM
Citation
 Shi, YPark, JLagisetti, CZhou, WSambucetti, LCWebb, TR A triple exon-skipping luciferase reporter assay identifies a new CLK inhibitor pharmacophore. Bioorg Med Chem Lett 27:406-412 (2017)  
Target
Name:
Dual specificity protein kinase CLK2
Synonyms:
2.7.12.1 CDC-like kinase 2 (CLK2) CLK2 | CLK2_HUMAN
Type:
Mol. Mass.:
60128.79
Organism:
Homo sapiens (Human)
Description:
P49760
Residue:
499
  
Inhibitor
Name:
BDBM50235029
Synonyms:
CHEMBL4084116
Type:
Small organic molecule
Emp. Form.:
C18H23ClN8
Mol. Mass.:
386.882
SMILES:
CC(C)n1cnc2c(Nc3cc(N)cc(Cl)c3)nc(N[C@@H]3CCNC3)nc12
: