Target
Adenosine receptor A2a
Ligand
BDBM50235043
Substrate
Meas. Tech.
ChEMBL_1654437 (CHEMBL4003803)
Ki
2.8±n/a nM
Citation
 Basu, SBarawkar, DAThorat, SShejul, YDPatel, MNaykodi, MJain, VSalve, YPrasad, VChaudhary, SGhosh, IBhat, GQuraishi, APatil, HAnsari, SMenon, SUnadkat, VThakare, RSeervi, MSMeru, AVDe, SBhamidipati, RKRouduri, SRPalle, VPChug, AMookhtiar, KA Design, Synthesis of Novel, Potent, Selective, Orally Bioavailable Adenosine A J Med Chem 60:681-694 (2017)  
Target
Name:
Adenosine receptor A2a
Synonyms:
A2A adenosine receptor (hA2A) ADENOSINE A2 ADORA2 Adenosine A2A receptor (A2AAR)
Type:
G Protein-Coupled Receptor (GPCR)
Mol. Mass.:
44716.46
Organism:
Homo sapiens (Human)
Description:
P29274
Residue:
412
  
Inhibitor
Name:
BDBM50235043
Synonyms:
CHEMBL4095424
Type:
Small organic molecule
Emp. Form.:
C22H24FN3O4S
Mol. Mass.:
445.507
SMILES:
COc1ccc(N2CCOCC2)c2sc(NC(=O)C(C)(C)Oc3cccc(F)c3)nc12
: