Target
Prostaglandin G/H synthase 2
Ligand
BDBM50235074
Substrate
Meas. Tech.
ChEMBL_1654649 (CHEMBL4004015)
IC50
9580±n/a nM
Citation
 Ali, YAlam, MSHamid, HHusain, ADhulap, ABano, SKharbanda, C Novel 2,4-dichlorophenoxy acetic acid substituted thiazolidin-4-ones as anti-inflammatory agents: Design, synthesis and biological screening. Bioorg Med Chem Lett 27:1017-1025 (2017)  
Target
Name:
Prostaglandin G/H synthase 2
Synonyms:
COX2 Cyclooxygenase 2 (COX-2) Cyclooxygenase-2 (COX-2 AA) Cyclooxygenase-2 (COX-2) PGH2_HUMAN PHS II Prostaglandin E synthase/G/H synthase 2 Prostaglandin-endoperoxide synthase 2
Type:
Enzyme
Mol. Mass.:
69003.89
Organism:
Homo sapiens (Human)
Description:
Recombinant Cox-2 provided by Cayman (Cayman Chemical Co.,Ann Arbor, MI).
Residue:
604
  
Inhibitor
Name:
BDBM50235074
Synonyms:
CHEMBL4100043
Type:
Small organic molecule
Emp. Form.:
C17H12BrCl2N3O3S
Mol. Mass.:
489.17
SMILES:
Clc1ccc(OCC(=O)N\N=C2\SCC(=O)N2c2ccc(Br)cc2)c(Cl)c1
: