Target
Carboxylic ester hydrolase
Ligand
BDBM50014323
Substrate
Meas. Tech.
ChEMBL_1655009 (CHEMBL4004375)
IC50
48±n/a nM
Citation
 Singh, HSingh, JVGupta, MKSingh, PSharma, SNepali, KBedi, PMS Benzoflavones as cholesterol esterase inhibitors: Synthesis, biological evaluation and docking studies. Bioorg Med Chem Lett 27:850-854 (2017)  
Target
Name:
Carboxylic ester hydrolase
Synonyms:
3.1.1.- Carboxylic ester hydrolase
Type:
PROTEIN
Mol. Mass.:
63554.81
Organism:
Sus scrofa
Description:
ChEMBL_117582
Residue:
585
  
Inhibitor
Name:
BDBM50014323
Synonyms:
2-PHENYL-4H-BENZO[H]CHROMEN-4-ONE 7,8-Benzoflavone alpha-naphthoflavone
Type:
Small organic molecule
Emp. Form.:
C19H12O2
Mol. Mass.:
272.2974
SMILES:
O=c1cc(oc2c3ccccc3ccc12)-c1ccccc1
: