Target
Protein kinase C beta type
Ligand
BDBM50235281
Substrate
Meas. Tech.
ChEMBL_1655175 (CHEMBL4004541)
IC50
3.3±n/a nM
Citation
 van Eis, MJEvenou, JSchuler, WZenke, GVangrevelinghe, EWagner, Jvon Matt, P Indolyl-naphthyl-maleimides as potent and selective inhibitors of protein kinase C-a/ß. Bioorg Med Chem Lett 27:781-786 (2017)  
Target
Name:
Protein kinase C beta type
Synonyms:
KPCB_HUMAN PKC beta PKCB PRKCB1 Protein kinase C beta type | Protein kinase C beta type II (PRKCB2)
Type:
Enzyme
Mol. Mass.:
76873.67
Organism:
Homo sapiens (Human)
Description:
The recombinant human PKC enzymes were produced using a baculovirus expression system in SF9 cells
Residue:
671
  
Inhibitor
Name:
BDBM50235281
Synonyms:
CHEMBL4089665
Type:
Small organic molecule
Emp. Form.:
C24H18ClN3O2
Mol. Mass.:
415.872
SMILES:
Cn1cc(C2=C(C(=O)NC2=O)c2c(Cl)ccc3ccc(CN)cc23)c2ccccc12
: