Target
Protein kinase C beta type
Ligand
BDBM50235292
Substrate
Meas. Tech.
ChEMBL_1655175 (CHEMBL4004541)
IC50
3.4±n/a nM
Citation
 van Eis, MJEvenou, JSchuler, WZenke, GVangrevelinghe, EWagner, Jvon Matt, P Indolyl-naphthyl-maleimides as potent and selective inhibitors of protein kinase C-a/ß. Bioorg Med Chem Lett 27:781-786 (2017)  
Target
Name:
Protein kinase C beta type
Synonyms:
KPCB_HUMAN PKC beta PKCB PRKCB1 Protein kinase C beta type | Protein kinase C beta type II (PRKCB2)
Type:
Enzyme
Mol. Mass.:
76873.67
Organism:
Homo sapiens (Human)
Description:
The recombinant human PKC enzymes were produced using a baculovirus expression system in SF9 cells
Residue:
671
  
Inhibitor
Name:
BDBM50235292
Synonyms:
CHEMBL4085837
Type:
Small organic molecule
Emp. Form.:
C25H20ClN3O2
Mol. Mass.:
429.898
SMILES:
CN(C)Cc1ccc2c(C3=C(C(=O)NC3=O)c3c[nH]c4ccccc34)c(Cl)ccc2c1
: