Target
Histone-lysine N-methyltransferase, H3 lysine-79 specific
Ligand
BDBM50235299
Substrate
Meas. Tech.
ChEMBL_1655312 (CHEMBL4004678)
IC50
4.0±n/a nM
Citation
 Möbitz, HMachauer, RHolzer, PVaupel, AStauffer, FRagot, CCaravatti, GScheufler, CFernandez, CHommel, UTiedt, RBeyer, KSChen, CZhu, HGaul, C Discovery of Potent, Selective, and Structurally Novel Dot1L Inhibitors by a Fragment Linking Approach. ACS Med Chem Lett 8:338-343 (2017)  
Target
Name:
Histone-lysine N-methyltransferase, H3 lysine-79 specific
Synonyms:
2.1.1.43 DOT1-like protein (Dot1L) DOT1L_HUMAN Histone H3-K79 methyltransferase Histone Methyltransferase DOT1L KIAA1814 Lysine N-methyltransferase 4
Type:
Protein
Mol. Mass.:
184911.91
Organism:
Homo sapiens (Human)
Description:
Q8TEK3
Residue:
1537
  
Inhibitor
Name:
BDBM50235299
Synonyms:
CHEMBL4066397
Type:
Small organic molecule
Emp. Form.:
C31H34ClN9O2
Mol. Mass.:
600.114
SMILES:
Clc1ccccc1-n1ccc2ccc(NC(=O)NCC(=O)NCCCN[C@@H]3CCCN(C3)c3ncnc4[nH]ccc34)cc12
: