Target
Prostaglandin G/H synthase 2
Ligand
BDBM50235320
Substrate
Meas. Tech.
ChEMBL_1655423 (CHEMBL4004893)
IC50
1410±n/a nM
Citation
 Abdelrahman, MHYoussif, BGMAbdelgawad, MAAbdelazeem, AHIbrahim, HMMoustafa, AEGATreamblu, LBukhari, SNA Synthesis, biological evaluation, docking study and ulcerogenicity profiling of some novel quinoline-2-carboxamides as dual COXs/LOX inhibitors endowed with anti-inflammatory activity. Eur J Med Chem 127:972-985 (2017)  
Target
Name:
Prostaglandin G/H synthase 2
Synonyms:
COX2 Cyclooxygenase 2 (COX-2) Cyclooxygenase-2 (COX-2 AA) Cyclooxygenase-2 (COX-2) PGH2_HUMAN PHS II Prostaglandin E synthase/G/H synthase 2 Prostaglandin-endoperoxide synthase 2
Type:
Enzyme
Mol. Mass.:
69003.89
Organism:
Homo sapiens (Human)
Description:
Recombinant Cox-2 provided by Cayman (Cayman Chemical Co.,Ann Arbor, MI).
Residue:
604
  
Inhibitor
Name:
BDBM50235320
Synonyms:
CHEMBL4087573
Type:
Small organic molecule
Emp. Form.:
C17H19ClN2O2
Mol. Mass.:
318.798
SMILES:
Cc1c(O)c2cc(Cl)ccc2nc1C(=O)NC1CCCCC1
: