Target
Acetylcholinesterase
Ligand
BDBM50235323
Substrate
Meas. Tech.
ChEMBL_1655445 (CHEMBL4004915)
IC50
0.200000±n/a nM
Citation
 Sameem, BSaeedi, MMahdavi, MShafiee, A A review on tacrine-based scaffolds as multi-target drugs (MTDLs) for Alzheimer's disease. Eur J Med Chem 128:332-345 (2017)  
Target
Name:
Acetylcholinesterase
Synonyms:
ACES_RAT Acetylcholinesterase and butyrylcholinesterase (AChE and BChE) Acetylcholinesterase, AChE | Ache
Type:
Enzyme
Mol. Mass.:
68193.62
Organism:
Rattus norvegicus (rat)
Description:
P37136
Residue:
614
  
Inhibitor
Name:
BDBM50235323
Synonyms:
CHEMBL4080023
Type:
Small organic molecule
Emp. Form.:
C34H46N4
Mol. Mass.:
510.7558
SMILES:
C(CCCCNc1c2CCCCc2nc2ccccc12)CCCNc1c2CCCCc2nc2CCCCc12
: