Target
Cyclin-A2
Ligand
BDBM50235338
Substrate
Meas. Tech.
ChEMBL_1655488 (CHEMBL4004958)
IC50
61000±n/a nM
Citation
 Coxon, CRAnscombe, EHarnor, SJMartin, MPCarbain, BGolding, BTHardcastle, IRHarlow, LKKorolchuk, SMatheson, CJNewell, DRNoble, MESivaprakasam, MTudhope, SJTurner, DMWang, LZWedge, SRWong, CGriffin, RJEndicott, JACano, C Cyclin-Dependent Kinase (CDK) Inhibitors: Structure-Activity Relationships and Insights into the CDK-2 Selectivity of 6-Substituted 2-Arylaminopurines. J Med Chem 60:1746-1767 (2017)  
Target
Name:
Cyclin-A2
Synonyms:
CCNA2 Cyclin-A | Cyclin-A2
Type:
PROTEIN
Mol. Mass.:
48258.58
Organism:
Bos taurus
Description:
ChEMBL_117723
Residue:
430
  
Inhibitor
Name:
BDBM50235338
Synonyms:
CHEMBL4072170
Type:
Small organic molecule
Emp. Form.:
C11H9N5
Mol. Mass.:
211.2227
SMILES:
N(c1ccccc1)c1ncc2nc[nH]c2n1
: