Target
Polycomb protein EED
Ligand
BDBM50235658
Substrate
Meas. Tech.
ChEMBL_1657638 (CHEMBL4007108)
Ki
0.650000±n/a nM
Citation
 Curtin, MLPliushchev, MALi, HQTorrent, MDietrich, JDJakob, CGZhu, HZhao, HWang, YJi, ZClark, RFSarris, KASelvaraju, SShaw, BAlgire, MAHe, YRichardson, PLSweis, RFSun, CChiang, GGMichaelides, MR SAR of amino pyrrolidines as potent and novel protein-protein interaction inhibitors of the PRC2 complex through EED binding. Bioorg Med Chem Lett 27:1576-1583 (2017)  
Target
Name:
Polycomb protein EED
Synonyms:
EED WAIT-1 hEED
Type:
Protein
Mol. Mass.:
50201.68
Organism:
Homo sapiens (Human)
Description:
O75530
Residue:
441
  
Inhibitor
Name:
BDBM50235658
Synonyms:
CHEMBL4073166
Type:
Small organic molecule
Emp. Form.:
C24H33FN6O
Mol. Mass.:
440.5568
SMILES:
CN(C)[C@H]1CN(Cc2c(C)cccc2F)C[C@@H]1C1CCN(CC1)c1cnc(cn1)C(N)=O
: