Target
Carbonic anhydrase 1
Ligand
BDBM50235689
Substrate
Meas. Tech.
ChEMBL_1657655 (CHEMBL4007125)
Ki
6780±n/a nM
Citation
 Fares, MEladwy, RANocentini, AEl Hadi, SRAGhabbour, HAAbdel-Megeed, AEldehna, WMAbdel-Aziz, HASupuran, CT Synthesis of bulky-tailed sulfonamides incorporating pyrido[2,3-d][1,2,4]triazolo[4,3-a]pyrimidin-1(5H)-yl) moieties and evaluation of their carbonic anhydrases I, II, IV and IX inhibitory effects. Bioorg Med Chem 25:2210-2217 (2017)  
Target
Name:
Carbonic anhydrase 1
Synonyms:
CA-I CAB Carbonate dehydratase I Carbonic anhydrase 1 (CA I) Carbonic anhydrase 1 (Recombinant CA I) Carbonic anhydrase B Carbonic anhydrase I (CA I) Carbonic anhydrase I (CAI) Carbonic anhydrase isoenzyme I (hCA I) | hCA
Type:
Enzyme
Mol. Mass.:
28873.37
Organism:
Homo sapiens (Human)
Description:
P00915
Residue:
261
  
Inhibitor
Name:
BDBM50235689
Synonyms:
CHEMBL3288908
Type:
Small organic molecule
Emp. Form.:
C26H18N6O4S2
Mol. Mass.:
542.589
SMILES:
CC(=O)c1nn(-c2ccc(cc2)S(N)(=O)=O)c2nc3nc(cc(-c4ccccc4)c3c(=O)n12)-c1cccs1
: