Target
Carbonic anhydrase 2
Ligand
BDBM50235689
Substrate
Meas. Tech.
ChEMBL_1657657 (CHEMBL4007127)
Ki
730±n/a nM
Citation
 Fares, MEladwy, RANocentini, AEl Hadi, SRAGhabbour, HAAbdel-Megeed, AEldehna, WMAbdel-Aziz, HASupuran, CT Synthesis of bulky-tailed sulfonamides incorporating pyrido[2,3-d][1,2,4]triazolo[4,3-a]pyrimidin-1(5H)-yl) moieties and evaluation of their carbonic anhydrases I, II, IV and IX inhibitory effects. Bioorg Med Chem 25:2210-2217 (2017)  
Target
Name:
Carbonic anhydrase 2
Synonyms:
CA-II CAC Carbonate dehydratase II Carbonic anhydrase 2 (CA-II) Carbonic anhydrase C Carbonic anhydrase II (CA-II) Carbonic anhydrase II (hCA II) | Carbonic anhydrase isoenzyme II (hCA II)
Type:
Enzyme
Mol. Mass.:
29250.71
Organism:
Homo sapiens (Human)
Description:
P00918
Residue:
260
  
Inhibitor
Name:
BDBM50235689
Synonyms:
CHEMBL3288908
Type:
Small organic molecule
Emp. Form.:
C26H18N6O4S2
Mol. Mass.:
542.589
SMILES:
CC(=O)c1nn(-c2ccc(cc2)S(N)(=O)=O)c2nc3nc(cc(-c4ccccc4)c3c(=O)n12)-c1cccs1
: