Target
Carbonic anhydrase 9
Ligand
BDBM50235694
Substrate
Meas. Tech.
ChEMBL_1657660 (CHEMBL4007130)
Ki
250±n/a nM
Citation
 Fares, MEladwy, RANocentini, AEl Hadi, SRAGhabbour, HAAbdel-Megeed, AEldehna, WMAbdel-Aziz, HASupuran, CT Synthesis of bulky-tailed sulfonamides incorporating pyrido[2,3-d][1,2,4]triazolo[4,3-a]pyrimidin-1(5H)-yl) moieties and evaluation of their carbonic anhydrases I, II, IV and IX inhibitory effects. Bioorg Med Chem 25:2210-2217 (2017)  
Target
Name:
Carbonic anhydrase 9
Synonyms:
CA-IX CAH9_HUMAN Carbonic anhydrase 9 (CA IX) Carbonic anhydrase 9 precursor Carbonic anhydrase IX (CAIX) Carbonic anhydrases; II & IX MN RCC-associated antigen G250
Type:
Enzyme
Mol. Mass.:
49669.03
Organism:
Homo sapiens (Human)
Description:
Catalytic domain of human cloned isozyme was used in the assay
Residue:
459
  
Inhibitor
Name:
BDBM50235694
Synonyms:
CHEMBL4095288
Type:
Small organic molecule
Emp. Form.:
C28H18ClFN6O4S
Mol. Mass.:
588.997
SMILES:
CC(=O)c1nn(-c2ccc(cc2)S(N)(=O)=O)c2nc3nc(cc(-c4ccc(F)cc4)c3c(=O)n12)-c1ccc(Cl)cc1
: