Target
Histone deacetylase 4
Ligand
BDBM50235707
Substrate
Meas. Tech.
ChEMBL_1657750 (CHEMBL4007220)
Ki
>50000±n/a nM
Citation
 Meyners, CWolff, BKleinschek, AKrämer, AMeyer-Almes, FJ Perfluorinated hydroxamic acids are potent and selective inhibitors of HDAC-like enzymes from Pseudomonas aeruginosa. Bioorg Med Chem Lett 27:1508-1512 (2017)  
Target
Name:
Histone deacetylase 4
Synonyms:
Cereblon/Histone deacetylase 4 HDAC4 Histone acetylase 4(HDAC4) KIAA0288
Type:
Enzyme
Mol. Mass.:
119049.39
Organism:
Homo sapiens (Human)
Description:
P56524
Residue:
1084
  
Inhibitor
Name:
BDBM50235707
Synonyms:
CHEMBL4095542
Type:
Small organic molecule
Emp. Form.:
C15H10F12N2O4
Mol. Mass.:
510.2317
SMILES:
COc1ccc(NC(=O)C(F)(F)C(F)(F)C(F)(F)C(F)(F)C(F)(F)C(F)(F)C(=O)NO)cc1
: