Target
Sodium-dependent noradrenaline transporter
Ligand
BDBM50235734
Substrate
Meas. Tech.
ChEMBL_1657815 (CHEMBL4007285)
IC50
99±n/a nM
Citation
 Paudel, SAcharya, SYoon, GKim, KMCheon, SH Design, synthesis and in vitro activity of 1,4-disubstituted piperazines and piperidines as triple reuptake inhibitors. Bioorg Med Chem 25:2266-2276 (2017)  
Target
Name:
Sodium-dependent noradrenaline transporter
Synonyms:
Monoamine transporter NET Noradrenaline Transporter (NET) Norepinephrine transporter protein (NET) SLC6A2 Sodium-dependent noradrenaline transporter (NET) | Solute carrier family 6 member 2
Type:
Multi-pass membrane protein
Mol. Mass.:
69337.72
Organism:
Homo sapiens (Human)
Description:
P23975
Residue:
617
  
Inhibitor
Name:
BDBM50235734
Synonyms:
CHEMBL4083724
Type:
Small organic molecule
Emp. Form.:
C31H38N6
Mol. Mass.:
494.6736
SMILES:
C(CCn1nnnc1C(c1ccccc1)c1ccccc1)CN1CCN(CCCc2ccccc2)CC1
: