Target
Sodium-dependent dopamine transporter
Ligand
BDBM50235736
Substrate
Meas. Tech.
ChEMBL_1657816 (CHEMBL4007286)
IC50
292±n/a nM
Citation
 Paudel, SAcharya, SYoon, GKim, KMCheon, SH Design, synthesis and in vitro activity of 1,4-disubstituted piperazines and piperidines as triple reuptake inhibitors. Bioorg Med Chem 25:2266-2276 (2017)  
Target
Name:
Sodium-dependent dopamine transporter
Synonyms:
DA transporter DAT1 Dopamine transporter protein (DAT) SC6A3_HUMAN Sodium-dependent dopamine transporter Solute carrier family 6 member 3
Type:
Multi-pass membrane protein
Mol. Mass.:
68497.11
Organism:
Homo sapiens (Human)
Description:
Q01959
Residue:
620
  
Inhibitor
Name:
BDBM50235736
Synonyms:
CHEMBL4074999
Type:
Small organic molecule
Emp. Form.:
C28H32N6
Mol. Mass.:
452.5939
SMILES:
C(CN1CCN(Cc2ccccc2)CC1)Cn1nnnc1C(c1ccccc1)c1ccccc1
: