Target
Sodium-dependent dopamine transporter
Ligand
BDBM50235730
Substrate
Meas. Tech.
ChEMBL_1657816 (CHEMBL4007286)
IC50
190±n/a nM
Citation
 Paudel, SAcharya, SYoon, GKim, KMCheon, SH Design, synthesis and in vitro activity of 1,4-disubstituted piperazines and piperidines as triple reuptake inhibitors. Bioorg Med Chem 25:2266-2276 (2017)  
Target
Name:
Sodium-dependent dopamine transporter
Synonyms:
DA transporter DAT1 Dopamine transporter protein (DAT) SC6A3_HUMAN Sodium-dependent dopamine transporter Solute carrier family 6 member 3
Type:
Multi-pass membrane protein
Mol. Mass.:
68497.11
Organism:
Homo sapiens (Human)
Description:
Q01959
Residue:
620
  
Inhibitor
Name:
BDBM50235730
Synonyms:
CHEMBL3613151
Type:
Small organic molecule
Emp. Form.:
C28H32N2O
Mol. Mass.:
412.5665
SMILES:
O=C(NCCN1CCC(Cc2ccccc2)CC1)C(c1ccccc1)c1ccccc1
: