Target
Tyrosine-protein kinase SYK
Ligand
BDBM50235818
Substrate
Meas. Tech.
ChEMBL_1658036 (CHEMBL4007648)
EC50
39±n/a nM
Citation
 Hoemann, MWilson, NArgiriadi, MBanach, DBurchat, ACalderwood, DClapham, BCox, PDuignan, DBKonopacki, DSomal, GVasudevan, A Synthesis and optimization of furano[3,2-d]pyrimidines as selective spleen tyrosine kinase (Syk) inhibitors. Bioorg Med Chem Lett 26:5562-5567 (2016)  
Target
Name:
Tyrosine-protein kinase SYK
Synonyms:
KSYK_HUMAN Spleen Tyrosine Kinase Tyrosine-protein kinase SYK (Syk)
Type:
Enzyme
Mol. Mass.:
72079.99
Organism:
Homo sapiens (Human)
Description:
P43405
Residue:
635
  
Inhibitor
Name:
BDBM50235818
Synonyms:
CHEMBL4071441
Type:
Small organic molecule
Emp. Form.:
C23H26N6O4
Mol. Mass.:
450.4903
SMILES:
COC(=O)N[C@@H]1CC(C)(C)c2ccc(Nc3nc(NC4CC4)c4occc4n3)cc2NC1=O
: