Target
Tyrosine-protein kinase SYK
Ligand
BDBM50235828
Substrate
Meas. Tech.
ChEMBL_1658035 (CHEMBL4007647)
IC50
5±n/a nM
Citation
 Hoemann, MWilson, NArgiriadi, MBanach, DBurchat, ACalderwood, DClapham, BCox, PDuignan, DBKonopacki, DSomal, GVasudevan, A Synthesis and optimization of furano[3,2-d]pyrimidines as selective spleen tyrosine kinase (Syk) inhibitors. Bioorg Med Chem Lett 26:5562-5567 (2016)  
Target
Name:
Tyrosine-protein kinase SYK
Synonyms:
KSYK_HUMAN Spleen Tyrosine Kinase Tyrosine-protein kinase SYK (Syk)
Type:
Enzyme
Mol. Mass.:
72079.99
Organism:
Homo sapiens (Human)
Description:
P43405
Residue:
635
  
Inhibitor
Name:
BDBM50235828
Synonyms:
CHEMBL4090753
Type:
Small organic molecule
Emp. Form.:
C20H21N5O3
Mol. Mass.:
379.4124
SMILES:
CC1(C)OCC(=O)Nc2cc(Nc3nc(NC4CC4)c4occc4n3)ccc12
: