Target
Mineralocorticoid receptor
Ligand
BDBM50235933
Substrate
Meas. Tech.
ChEMBL_1658437 (CHEMBL4008049)
Ki
12±n/a nM
Citation
 Martín-Martínez, MPérez-Gordillo, FLÁlvarez de la Rosa, DRodríguez, YGerona-Navarro, GGonzález-Muñiz, RZhou, MM Modulating Mineralocorticoid Receptor with Non-steroidal Antagonists. New Opportunities for the Development of Potent and Selective Ligands without Off-Target Side Effects. J Med Chem 60:2629-2650 (2017)  
Target
Name:
Mineralocorticoid receptor
Synonyms:
MCR MLR NR3C2 | Nuclear receptor subfamily 3 group C member 2
Type:
Enzyme
Mol. Mass.:
107076.42
Organism:
Homo sapiens (Human)
Description:
P08235
Residue:
984
  
Inhibitor
Name:
BDBM50235933
Synonyms:
CHEMBL3775714
Type:
Small organic molecule
Emp. Form.:
C22H15FN2O2
Mol. Mass.:
358.3651
SMILES:
Fc1ccc2c(OCc3ccccc3\C2=C/c2ccc3[nH]c(=O)[nH]c3c2)c1
: