Target
Polymerase acidic protein
Ligand
BDBM50125822
Substrate
Meas. Tech.
ChEMBL_1658603 (CHEMBL4008215)
IC50
5100±n/a nM
Citation
 Ju, HZhang, JHuang, BKang, DHuang, BLiu, XZhan, P Inhibitors of Influenza Virus Polymerase Acidic (PA) Endonuclease: Contemporary Developments and Perspectives. J Med Chem 60:3533-3551 (2017)  
Target
Name:
Polymerase acidic protein
Synonyms:
Hepatitis C virus polyprotein PA/PB1 Polymerase acidic protein | RNA-directed RNA polymerase subunit P2
Type:
PROTEIN
Mol. Mass.:
82573.84
Organism:
Hepatitis C virus
Description:
ChEMBL_64976
Residue:
716
  
Inhibitor
Name:
BDBM50125822
Synonyms:
1-Hydroxy-5-isobutyl-3-isobutylidene-3H-pyrazine-2,6-dione CHEMBL16320
Type:
Small organic molecule
Emp. Form.:
C12H18N2O3
Mol. Mass.:
238.2829
SMILES:
CC(C)C=c1[nH]c(=CC(C)C)c(=O)n(O)c1=O
: