Target
dCTP pyrophosphatase 1
Ligand
BDBM50236117
Substrate
Meas. Tech.
ChEBML_1658761
IC50
271±n/a nM
Citation
 Llona-Minguez, SHöglund, AWiita, EAlmlöf, IMateus, ACalderón-Montaño, JMCazares-Körner, CHoman, ELoseva, OBaranczewski, PJemth, ASHäggblad, MMartens, ULundgren, BArtursson, PLundbäck, TJenmalm Jensen, AWarpman Berglund, UScobie, MHelleday, T Identification of Triazolothiadiazoles as Potent Inhibitors of the dCTP Pyrophosphatase 1. J Med Chem 60:2148-2154 (2017)  
Target
Name:
dCTP pyrophosphatase 1
Synonyms:
DCTP1_HUMAN Deoxycytidine-triphosphatase 1 dCTP pyrophosphatase 1 | dCTP pyrophosphatase 1 (DCTPP1)
Type:
Protein
Mol. Mass.:
18673.58
Organism:
Homo sapiens (Human)
Description:
Q9H773
Residue:
170
  
Inhibitor
Name:
BDBM50236117
Synonyms:
CHEMBL4083779
Type:
Small organic molecule
Emp. Form.:
C14H8ClN5S
Mol. Mass.:
313.765
SMILES:
Clc1cccc(c1)-c1nn2c(nnc2s1)-c1ccccn1
: