Target
Lethal factor
Ligand
BDBM50236204
Substrate
Meas. Tech.
ChEMBL_1658817 (CHEMBL4008429)
IC50
100±n/a nM
Citation
 Li, YGould, AAboye, TBi, TBreindel, LShekhtman, ACamarero, JA Full Sequence Amino Acid Scanning of¿-Defensin RTD-1 Yields a Potent Anthrax Lethal Factor Protease Inhibitor. J Med Chem 60:1916-1927 (2017)  
Target
Name:
Lethal factor
Synonyms:
Anthrax Lethal Factor (LF) Antrax lethal toxin lef | lethal factor
Type:
PROTEIN
Mol. Mass.:
93758.56
Organism:
Bacillus anthracis
Description:
ChEMBL_1460338
Residue:
809
  
Inhibitor
Name:
BDBM50236204
Synonyms:
CHEMBL4091315
Type:
Small organic molecule
Emp. Form.:
C102H145N39O19S6
Mol. Mass.:
2413.883
SMILES:
C[C@@H](O)[C@@H]1NC(=O)[C@@H]2CSSC[C@H](NC(=O)[C@H](Cc3ccccc3)NC(=O)CNC(=O)[C@H](CCCNC(N)=N)NC1=O)C(=O)N[C@@H](CCCNC(N)=N)C(=O)N[C@H]1CSSC[C@H](NC(=O)[C@H](CCCNC(N)=N)NC(=O)[C@@H]3CSSC[C@H](NC(=O)[C@H](Cc4c[nH]c5ccccc45)NC1=O)C(=O)N[C@@H](CCCNC(N)=N)C(=O)N[C@@H](CCCNC(N)=N)C(=O)N[C@@H](CCCNC(N)=N)C(=O)N[C@@H](Cc1c[nH]c4ccccc14)C(=O)N3)C(=O)N[C@@H](Cc1c[nH]c3ccccc13)C(=O)N2
: