Target
cGMP-dependent 3',5'-cyclic phosphodiesterase
Ligand
BDBM50236225
Substrate
Meas. Tech.
ChEBML_1658917
EC50
670±n/a nM
Citation
 Gomez, LMassari, MEVickers, TFreestone, GVernier, WLy, KXu, RMcCarrick, MMarrone, TMetz, MYan, YGYoder, ZWLemus, RBroadbent, NJBarido, RWarren, NSchmelzer, KNeul, DLee, DAndersen, CBSebring, KAertgeerts, KZhou, XTabatabaei, APeters, MBreitenbucher, JG Design and Synthesis of Novel and Selective Phosphodiesterase 2 (PDE2a) Inhibitors for the Treatment of Memory Disorders. J Med Chem 60:2037-2051 (2017)  
Target
Name:
cGMP-dependent 3',5'-cyclic phosphodiesterase
Synonyms:
PDE2A_RAT Phosphodiesterase 2A
Type:
PROTEIN
Mol. Mass.:
104640.72
Organism:
Rattus norvegicus
Description:
ChEMBL_156330
Residue:
928
  
Inhibitor
Name:
BDBM50236225
Synonyms:
CHEMBL4074744 US11419874, DNS-8254
Type:
Small organic molecule
Emp. Form.:
C18H15BrF3N5O
Mol. Mass.:
454.244
SMILES:
Cc1cc([C@@H]2CN(CC(F)(F)C2)C(=O)c2ccc(F)c(Br)c2)n2ncnc2n1
: